Join FlipAndroid.COM Telegram Group: https://t.me/joinchat/F_aqThGkhwcLzmI49vKAiw


Tag: Gradle

Gradle 4.0 No se puede encontrar una configuración coincidente

Estoy tratando de abrir mi proyecto existente en el nuevo Android Studio 3.0 canary 2. He actualizado Gradle de acuerdo a las instrucciones , los nombres cambiados para las configuraciones de dependencia, pero sigo recibiendo el siguiente error: Error:Could not resolve all dependencies for configuration ':bankOK:betaNewApiInnerTestRuntimeClasspath'. > Unable to find a matching configuration in project […]

¿Cómo se pueden manipular las salidas de variantes con el complemento Android Gradle 3.0.0+?

La última versión (3.0.0) del complemento de Android para Gradle ha roto su API para manipular salidas variantes . Esta API se utilizó para manipular archivos que creaban durante las compilaciones (como AndroidManifest.xml) y se ha eliminado para mejorar los tiempos de configuración. ¿Qué nuevas API están disponibles para manipular salidas variantes y cómo se […]

External AndroidManifest.xml no aparece en el panel de vista del proyecto

He estado desarrollando un proyecto Android con Android Studio y Gradle. El archivo AndroidManifest.xml mi proyecto se encuentra en una carpeta externa. Estoy señalando a él con el siguiente código en el archivo build.gradle : sourceSets { main { manifest.srcFile '..\\..\\..\\sources\\AndroidManifest.xml' } } Todo funciona muy bien, el proyecto se compila y se ejecuta, excepto […]

Uso del proyecto Scala con Gradle para Android

Parece que hay un escape de memoria en alguna parte. Al configurar un proyecto en IntelliJ y utilizar el contenedor Gradle: ./gradlew assembleDebug –debug Me sale el siguiente después de unos 5 minutos: 14:30:15.245 [INFO] [org.gradle.api.Project] processing scala/collection/SeqViewLike$$anon$5.class… 14:30:53.132 [INFO] [org.gradle.api.Project] processing scala/collection/SeqViewLike$$anon$6.class… 14:33:51.027 [ERROR] [org.gradle.api.Project] 14:33:51.028 [ERROR] [org.gradle.api.Project] UNEXPECTED TOP-LEVEL ERROR: 14:33:51.028 [ERROR] [org.gradle.api.Project] […]

Escritura del script Gradle para ejecutar casos de prueba de unidad para el proyecto Eclipse Android Test

Tengo un simple proyecto HelloWorld Android (construido en Eclipse IDE), puedo hacer "gradle build" con éxito en cmd prompt para este proyecto. También he escrito un simple JUnit Android Test Project para él, y funciona muy bien en Eclipse. Ahora quiero ejecutar este proyecto de prueba o casos de prueba de unidad (si mi comprensión […]

Definir buildConfigField para androidTest

Estoy definiendo un campo en particular en BuildConfig para obtener la URL durante el tiempo de ejecución. Por lo tanto, para cada tipo de compilación, utilizo una cadena diferente: prod { buildConfigField "String", "BASE_URL", "\"abc.com\"" } debug { buildConfigField "String", "BASE_URL", "\"efg.com\"" } ¿Es posible definir una URL diferente mientras se ejecutan las pruebas de […]

Roboblender-3.0.1.jar: no incluido en Android: javax.tools. Referido desde com.google.inject.blender.AnnotationDatabaseGenerator

Trato de construir mi proyecto android y obtengo: Information:Gradle: Executing tasks: [clean, :app:compileDebugSources] Information:1/10/15, 11:13 AM – Compilation completed successfully in 5 sec A continuación, intento desplegarlo en mi dispositivo y obtener: FAILURE: Build failed with an exception. * What went wrong: Execution failed for task ':app:lint'. > Lint found errors in the project; aborting […]

Gradle: sólo resolver las dependencias para la variante deseada

Tengo una aplicación de prueba con tres sabores: Dev: Utiliza una copia local de la biblioteca durante el desarrollo Qa: Utiliza una instantánea durante el control de calidad Rc: Utiliza una compilación de prerrelease para las pruebas de liberación de candidatos. dependencies { devCompile project(':library') qaCompile 'com.example:library:1.0.0-SNAPSHOT@aar' rcCompile 'com.example:library:1.0.0@aar' } Corro Gradle, y espero que […]

No se puede agregar gdx-tools al proyecto libgdx gradle

Soy nuevo en Gradle. Estoy intentando agregar gdx-tools a mi proyecto: project(":desktop") { apply plugin: "java" dependencies { compile project(":core") compile "com.badlogicgames.gdx:gdx-backend-lwjgl:$gdxVersion" compile "com.badlogicgames.gdx:gdx-platform:$gdxVersion:natives-desktop" compile "com.badlogicgames.gdx:gdx-box2d-platform:$gdxVersion:natives-desktop" compile "com.badlogicgames.gdx:gdx-tools:$gdxVersion" } } Abro mi proyecto de escritorio, carpeta "Gradle Dependecies" y ver "gdx-tools-1.0.1.jar". Como trato de abrirlo – nada muestra. Por lo tanto, cuando trato de usarlo […]

Android: Errores de clase duplicados en proguard

Al compilar mi aplicación, obtengo el siguiente error (fragmentos sensibles de ruta editados) Execution failed for task ':app:proguardDebug'. > java.io.IOException: Can't write [/projects/app/build/intermediates/classes-proguard/debug/classes.jar] (Can't read [/.gradle/caches/modules-2/files-2.1/commons-codec/commons-codec/1.4/4216af16d38465bbab0f3dff8efa14204f7a399a/commons-codec-1.4.jar(;;;;;;!META-INF/MANIFEST.MF)] (Duplicate zip entry [commons-codec-1.4.jar:org/apache/commons/codec/binary/Base64.class])) Esto me indica que el compilador ve dos lugares donde la aplicación está intentando usar commons.codec.binary.Base64.class como una dependencia. He comprobado y revisado mis bibliotecas […]

FlipAndroid es un fan de Google para Android, Todo sobre Android Phones, Android Wear, Android Dev y Aplicaciones para Android Aplicaciones.