Join FlipAndroid.COM Telegram Group: https://t.me/joinchat/F_aqThGkhwcLzmI49vKAiw


La ejecución falló para la tarea ': app: shrinkReleaseMultiDexComponents'

Estoy recibiendo el siguiente error al generar apk firmado en Android Studio.

:app:shrinkReleaseMultiDexComponents FAILED Error:Execution failed for task ':app:shrinkReleaseMultiDexComponents'. > java.io.IOException: The output jar [E:\SVN_studio\100's\trunk\app\build\intermediates\multi-dex\release\componentClasses.jar] must be specified after an input jar, or it will be empty. Information:BUILD FAILED Information:1 error Information:Total time: 35.975 secs Information:159 warnings 

Aquí está mi archivo build.gradle

  • ¿Qué es android multidex?
  • Android Espresso no funciona con Multidex da "No se encontraron pruebas"
  • Android Studio 2.0 Instant Run hace que DexFile no cargue todas las clases
  • Estudio de Android java.lang.NoClassDefFoundError: android.support.v4.app.NavUtilsJB
  • RoboGuice 3.0 NoClassDefFoundError: roboguice.inject.ContextScopedRoboInjector
  • Error: Error de ejecución para la tarea ': app: transformClassesWithDexForDebug'
  •  apply plugin: 'com.android.application' apply plugin: 'com.google.gms.google-services' android { compileSdkVersion 21 buildToolsVersion "22.0.1" defaultConfig { applicationId "<packageName>" minSdkVersion 16 targetSdkVersion 21 versionCode 1 versionName "1.0" multiDexEnabled true } buildTypes { release { minifyEnabled true shrinkResources true } } packagingOptions { exclude 'META-INF/LICENSE.txt' } lintOptions { abortOnError true; } } repositories { mavenCentral() } repositories { flatDir { dirs 'libs' } } dependencies { compile fileTree(include: ['*.jar'], dir: 'libs') compile 'com.nineoldandroids:library:2.4.0' compile 'com.android.support:design:22.2.1' compile 'com.google.android.gms:play-services-gcm:7.5.0' compile 'com.android.support:cardview-v7:21.0.+' compile 'com.github.ksoichiro:android-observablescrollview:1.5.0' compile 'com.android.support:support-v13:22.2.1' compile 'com.astuetz:pagerslidingtabstrip:1.0.1' compile 'com.nostra13.universalimageloader:universal-image-loader:1.9.4' compile 'com.android.support:recyclerview-v7:22.2.1' compile 'com.mikhaellopez:circularimageview:2.0.1' compile(name: 'app-debug', ext: 'aar') compile 'com.facebook.android:facebook-android-sdk:4.1.0' compile files('libs/YouTubeAndroidPlayerApi.jar') } 

    ¿No sabes por qué estoy recibiendo esos errores? ¿Alguien puede ayudarme?

  • La propiedad android.dexOptions.incremental está obsoleta
  • Android-Studio (o IDEA en general) refactor sobre múltiples conjuntos de fuentes
  • El registro de LibGDX no aparece en logcat
  • Vuforia Videoplayback issue - El video está jugando invertido
  • Generar APK firmado en Android Studio
  • Excepción: esto no es compatible, use MenuItemCompat.getActionProvider ()
  • 3 Solutions collect form web for “La ejecución falló para la tarea ': app: shrinkReleaseMultiDexComponents'”

    Intenta falsificar en minifyEnable y sincronizar proyecto

      buildTypes { release { minifyEnabled false proguardFiles getDefaultProguardFile('proguard-android.txt'), 'proguard-rules.pro' } } 

    Establezca minifyEnabled en false y Sync gradle y project.

    Prueba a eliminar …

     compile files('libs/YouTubeAndroidPlayerApi.jar') 
    FlipAndroid es un fan de Google para Android, Todo sobre Android Phones, Android Wear, Android Dev y Aplicaciones para Android Aplicaciones.