Join FlipAndroid.COM Telegram Group: https://t.me/joinchat/F_aqThGkhwcLzmI49vKAiw


Problema de integración a la biblioteca tess-two (Tesseract Tools para Android) en un estudio de Android y construir ndk

Quiero importar la biblioteca tess-two en el estudio android y después de la compilación mostrar error en la compilación ndk. Ya he intentado la solución dada en stackoverflow. como, La ejecución falló para la tarea ': app: compileDebugNdk', pero no resolvió mi problema. por favor, me sugieren dónde estoy haciendo mal.

Muestra el siguiente error:

  • Cómo resolver un nombre de dominio Bonjour con JmDNS
  • Cómo agregar iconos adyacentes a los títulos de Android Navigation Drawer
  • Imageview método de escala "centercrop" como código
  • EditText: establece el número de caracteres programáticamente
  • Apt dependencia alcance en Android gradle - ¿para qué se utiliza?
  • ¿Cómo puedo poner un adview admob en la pantalla de configuración de un fondo de pantalla en vivo?
  • Error:error: undefined reference to 'isnanf' Error:error: undefined reference to '__isinff' Error:error: undefined reference to 'isnanf' [arm64-v8a] Install : libtess.so => libs/arm64-v8a/libtess.so Error:error: undefined reference to 'isnanf' Error:error: undefined reference to '__isinff' Error:error: undefined reference to 'isnanf' [x86_64] Install : libjpgt.so => libs/x86_64/libjpgt.so Error:error: linker command failed with exit code 1 (use -v to see invocation) Error:error: linker command failed with exit code 1 (use -v to see invocation) make: *** [obj/local/armeabi-v7a/libtess.so] Error 1 make: *** Waiting for unfinished jobs.... make: *** [obj/local/armeabi/libtess.so] Error 1 make: Leaving directory `D:/OCR/tess-two-master/tess-two-master/tess-two' :tess-two:ndkBuild FAILED Error:Execution failed for task ':tess-two:ndkBuild'. Process 'command 'D:\SDK\sdk\ndk-bundle/ndk-build.cmd'' finished with non-zero exit value 2 

  • Descargar un archivo con Android y mostrar el progreso en un ProgressDialog
  • Reconectar para depurar proceso en Android usando Eclipse con ADT
  • Kotlin - Error intermitente de "archivo de clase incorrecta"
  • Detectar si el navegador tiene teclado / teclas de flecha en la página web
  • Escala Dibujable - ¿setImageLevel determina la escala?
  • Llamar al diálogo de Android sin que desaparezca el fondo
  • One Solution collect form web for “Problema de integración a la biblioteca tess-two (Tesseract Tools para Android) en un estudio de Android y construir ndk”

    Resulta que la causa principal de este error es que NDK r11 no es compatible con android-8 (Android 2.2.x), mientras que NDK r10 lo hizo.

    Cambiar el archivo Application.mk para usar APP_PLATFORM := android-9 corrige esto.

    FlipAndroid es un fan de Google para Android, Todo sobre Android Phones, Android Wear, Android Dev y Aplicaciones para Android Aplicaciones.